Reaction Details
TargetCannabinoid receptor 1
LigandBDBM50023672
Substrate/Competitorn/a
Meas. Tech.ChEMBL_1456017 (CHEMBL3366073)
IC50 1640±n/a nM
Citation German, NDecker, AMGilmour, BPGay, EAWiley, JLThomas, BFZhang, Y Diarylureas as allosteric modulators of the cannabinoid CB1 receptor: structure-activity relationship studies on 1-(4-chlorophenyl)-3-{3-[6-(pyrrolidin-1-yl)pyridin-2-yl]phenyl}urea (PSNCBAM-1). J Med Chem57:7758-69 (2014) 
 
Cannabinoid receptor 1
Name:Cannabinoid receptor 1
Type:G Protein-Coupled Receptor (GPCR)
Mol. Mass.:52868.96
Organism:Homo sapiens (Human)
Description:P21554
Residue:472
BDBM50023672
NameBDBM50023672
Synonyms:CHEMBL3341884
TypeSmall organic molecule
Emp. Form.C24H27N5O
Mol. Mass.401.5041
SMILESCN(C)c1ccc(NC(=O)Nc2cccc(c2)-c2cccc(n2)N2CCCC2)cc1