Reaction Details
TargetCannabinoid receptor 1
LigandBDBM50023633
Substrate/Competitorn/a
Meas. Tech.ChEMBL_1456022 (CHEMBL3366078)
EC50 55±n/a nM
Citation German, NDecker, AMGilmour, BPGay, EAWiley, JLThomas, BFZhang, Y Diarylureas as allosteric modulators of the cannabinoid CB1 receptor: structure-activity relationship studies on 1-(4-chlorophenyl)-3-{3-[6-(pyrrolidin-1-yl)pyridin-2-yl]phenyl}urea (PSNCBAM-1). J Med Chem57:7758-69 (2014) 
 
Cannabinoid receptor 1
Name:Cannabinoid receptor 1
Type:G Protein-Coupled Receptor (GPCR)
Mol. Mass.:52868.96
Organism:Homo sapiens (Human)
Description:P21554
Residue:472
BDBM50023633
NameBDBM50023633
Synonyms:CHEMBL3341880
TypeSmall organic molecule
Emp. Form.C23H21N5O
Mol. Mass.383.4457
SMILESO=C(Nc1ccc(cc1)C#N)Nc1cccc(c1)-c1cccc(n1)N1CCCC1