Reaction Details
TargetMitogen-activated protein kinase kinase kinase 5
LigandBDBM50023729
Substrate/Competitorn/a
Meas. Tech.ChEMBL_1448253 (CHEMBL3375026)
IC50 7.9±n/a nM
Citation Starosyla, SAVolynets, GPBdzhola, VGGolub, AGProtopopov, MVYarmoluk, SM ASK1 pharmacophore model derived from diverse classes of inhibitors. Bioorg Med Chem Lett24:4418-23 (2014) 
 
Mitogen-activated protein kinase kinase kinase 5
Name:Mitogen-activated protein kinase kinase kinase 5
Type:Protein
Mol. Mass.:154514.93
Organism:Homo sapiens (Human)
Description:Q99683
Residue:1374
BDBM50023729
NameBDBM50023729
Synonyms:CHEMBL3330168
TypeSmall organic molecule
Emp. Form.C24H20N4O2
Mol. Mass.396.4412
SMILESNC[C@H](Oc1cnc(-c2ccoc2)c(c1)-c1c[nH]c2ncccc12)c1ccccc1