Reaction Details
TargetAmine oxidase [flavin-containing] A
LigandBDBM50113851
Substrate/Competitorn/a
Meas. Tech.ChEMBL_1434487 (CHEMBL3388873)
IC50 1190±n/a nM
Citation Vianello, PBotrugno, OACappa, ACiossani, GDessanti, PMai, AMattevi, AMeroni, GMinucci, SThaler, FTortorici, MTrifiró, PValente, SVilla, MVarasi, MMercurio, C Synthesis, biological activity and mechanistic insights of 1-substituted cyclopropylamine derivatives: a novel class of irreversible inhibitors of histone demethylase KDM1A. Eur J Med Chem86:352-63 (2014) 
 
Amine oxidase [flavin-containing] A
Name:Amine oxidase [flavin-containing] A
Type:Protein
Mol. Mass.:59689.53
Organism:Homo sapiens (Human)
Description:P21397
Residue:527
BDBM50113851
NameBDBM50113851
Synonyms:(+/-)-Tranylcypromine 2-Phenyl-cyclopropylamine CHEMBL313833 Tranylcypromine,(+) US8609708, 6 Tranyl- cypromine | US8609708, 6 Tranylcypromine
TypeSmall organic molecule
Emp. Form.C9H11N
Mol. Mass.133.1903
SMILESNC1CC1c1ccccc1