Reaction Details
TargetSodium channel protein type 9 subunit alpha
LigandBDBM50024217
Substrate/Competitorn/a
Meas. Tech.ChEMBL_1435223 (CHEMBL3390669)
IC50 4.0±n/a nM
Citation Sun, SJia, QZenova, AYChafeev, MZhang, ZLin, SKwan, RGrimwood, MEChowdhury, SYoung, CCohen, CJOballa, RM The discovery of benzenesulfonamide-based potent and selective inhibitors of voltage-gated sodium channel Na(v)1.7. Bioorg Med Chem Lett24:4397-401 (2014) 
 
Sodium channel protein type 9 subunit alpha
Name:Sodium channel protein type 9 subunit alpha
Type:Protein
Mol. Mass.:226375.97
Organism:Homo sapiens (Human)
Description:Q15858
Residue:1988
BDBM50024217
NameBDBM50024217
Synonyms:CHEMBL3325537 | US9630929, Example 85
TypeSmall organic molecule
Emp. Form.C21H21ClF2N4O3S2
Mol. Mass.514.996
SMILESCN1CC[C@@H]([C@@H](COc2cc(F)c(cc2F)S(=O)(=O)Nc2ncns2)C1)c1ccc(Cl)cc1