Reaction Details
TargetSodium channel protein type 5 subunit alpha
LigandBDBM50024231
Substrate/Competitorn/a
Meas. Tech.ChEMBL_1435224 (CHEMBL3390670)
IC50 2600±n/a nM
Citation Sun, SJia, QZenova, AYChafeev, MZhang, ZLin, SKwan, RGrimwood, MEChowdhury, SYoung, CCohen, CJOballa, RM The discovery of benzenesulfonamide-based potent and selective inhibitors of voltage-gated sodium channel Na(v)1.7. Bioorg Med Chem Lett24:4397-401 (2014) 
 
Sodium channel protein type 5 subunit alpha
Name:Sodium channel protein type 5 subunit alpha
Type:Enzyme
Mol. Mass.:226908.60
Organism:Homo sapiens (Human)
Description:Q14524
Residue:2016
BDBM50024231
NameBDBM50024231
Synonyms:CHEMBL3325540
TypeSmall organic molecule
Emp. Form.C22H20ClF5N4O3S2
Mol. Mass.582.994
SMILESFc1cc(c(F)cc1OC[C@@H]1CN(CC(F)(F)F)CC[C@H]1c1ccc(Cl)cc1)S(=O)(=O)Nc1ncns1