Reaction Details
TargetSodium channel protein type 9 subunit alpha
LigandBDBM50024246
Substrate/Competitorn/a
Meas. Tech.ChEMBL_1435223 (CHEMBL3390669)
IC50 1.1±n/a nM
Citation Sun, SJia, QZenova, AYChafeev, MZhang, ZLin, SKwan, RGrimwood, MEChowdhury, SYoung, CCohen, CJOballa, RM The discovery of benzenesulfonamide-based potent and selective inhibitors of voltage-gated sodium channel Na(v)1.7. Bioorg Med Chem Lett24:4397-401 (2014) 
 
Sodium channel protein type 9 subunit alpha
Name:Sodium channel protein type 9 subunit alpha
Type:Protein
Mol. Mass.:226375.97
Organism:Homo sapiens (Human)
Description:Q15858
Residue:1988
BDBM50024246
NameBDBM50024246
Synonyms:CHEMBL3325526 | US9630929, Example 77
TypeSmall organic molecule
Emp. Form.C20H19ClF2N4O3S2
Mol. Mass.500.97
SMILESFc1cc(c(F)cc1OC[C@H]1CNCC[C@@H]1c1ccc(Cl)cc1)S(=O)(=O)Nc1ncns1