Reaction Details
Target5-hydroxytryptamine receptor 1A
LigandBDBM50024646
Substrate/Competitorn/a
Meas. Tech.ChEMBL_1438099 (CHEMBL3387900)
Ki 0.800000±n/a nM
Citation Kumar, JSMajo, VJPrabhakaran, JMann, JJ Synthesis and evaluation of arylpiperazines derivatives of 3,5-dioxo-(2H,4H)-1,2,4-triazine as 5-HT1AR ligands. Bioorg Med Chem Lett24:4759-62 (2014) 
 
5-hydroxytryptamine receptor 1A
Name:5-hydroxytryptamine receptor 1A
Type:n/a
Mol. Mass.:46122.49
Organism:Homo sapiens (Human)
Description:n/a
Residue:422
BDBM50024646
NameBDBM50024646
Synonyms:CHEMBL3330600
TypeSmall organic molecule
Emp. Form.C21H30FN5O3
Mol. Mass.419.493
SMILESCn1c(=O)cnn(CCCCN2CCN(CC2)c2ccccc2OCCCF)c1=O