Reaction Details
Target4-hydroxyphenylpyruvate dioxygenase
LigandBDBM50024738
Substrate/Competitorn/a
Meas. Tech.ChEMBL_1438115 (CHEMBL3388490)
Ki 238±n/a nM
Citation Xu, YLLin, HYCao, RJMing, ZZYang, WCYang, GF Pyrazolone-quinazolone hybrids: a novel class of human 4-hydroxyphenylpyruvate dioxygenase inhibitors. Bioorg Med Chem22:5194-211 (2014) 
 
4-hydroxyphenylpyruvate dioxygenase
Name:4-hydroxyphenylpyruvate dioxygenase
Type:PROTEIN
Mol. Mass.:44937.33
Organism:Homo sapiens (Human)
Description:ChEMBL_123
Residue:393
BDBM50024738
NameBDBM50024738
Synonyms:CHEMBL3342421
TypeSmall organic molecule
Emp. Form.C22H20N4O4
Mol. Mass.404.4186
SMILESCOc1ccc(cc1)-n1c(C)nc2ccc(cc2c1=O)C(=O)c1c(C)nn(C)c1O