Reaction Details
Target4-hydroxyphenylpyruvate dioxygenase
LigandBDBM50088804
Substrate/Competitorn/a
Meas. Tech.ChEMBL_1438115 (CHEMBL3388490)
Ki 37±n/a nM
Citation Xu, YLLin, HYCao, RJMing, ZZYang, WCYang, GF Pyrazolone-quinazolone hybrids: a novel class of human 4-hydroxyphenylpyruvate dioxygenase inhibitors. Bioorg Med Chem22:5194-211 (2014) 
 
4-hydroxyphenylpyruvate dioxygenase
Name:4-hydroxyphenylpyruvate dioxygenase
Type:PROTEIN
Mol. Mass.:44937.33
Organism:Homo sapiens (Human)
Description:ChEMBL_123
Residue:393
BDBM50088804
NameBDBM50088804
Synonyms:1,3-Cyclohexanedione, 2-(2-nitro-4-(trifluoromethyl)benzoyl)- 2-[2-nitro-4-(trifluoromethyl)benzoyl]cyclohexane-1,3-dione NITISINONE
TypeSmall organic molecule
Emp. Form.C14H10F3NO5
Mol. Mass.329.2281
SMILES[O-][N+](=O)c1cc(ccc1C(=O)C1C(=O)CCCC1=O)C(F)(F)F