Reaction Details
TargetFarnesyl pyrophosphate synthase
LigandBDBM50024797
Substrate/Competitorn/a
Meas. Tech.ChEMBL_1438881 (CHEMBL3381226)
Kd 2020000±n/a nM
Citation Scrima, MLauro, GGrimaldi, MDi Marino, STosco, APicardi, PGazzerro, PRiccio, RNovellino, EBifulco, MBifulco, GD'Ursi, AM Structural evidence of N6-isopentenyladenosine as a new ligand of farnesyl pyrophosphate synthase. J Med Chem57:7798-803 (2014) 
 
Farnesyl pyrophosphate synthase
Name:Farnesyl pyrophosphate synthase
Type:Enzyme
Mol. Mass.:48272.89
Organism:Homo sapiens (Human)
Description:P14324
Residue:419
BDBM50024797
NameBDBM50024797
Synonyms:CHEBI:60283 N6-Isopentenyladenosine
TypeSmall organic molecule
Emp. Form.C15H21N5O4
Mol. Mass.335.3583
SMILESCC(=C)CCNc1ncnc2n(cnc12)[C@@H]1O[C@H](CO)[C@@H](O)[C@H]1O