Reaction Details
TargetMineralocorticoid receptor
LigandBDBM50024849
Substrate/Competitorn/a
Meas. Tech.ChEMBL_1438886 (CHEMBL3381811)
IC50 8.4±n/a nM
Citation Hasui, TOhyabu, NOhra, TFuji, KSugimoto, TFujimoto, JAsano, KOosawa, MShiotani, SNishigaki, NKusumoto, KMatsui, HMizukami, AHabuka, NSogabe, SEndo, SOno, MSiedem, CSTang, TPGauthier, CDe Meese, LABoyd, SAFukumoto, S Discovery of 6-[5-(4-fluorophenyl)-3-methyl-pyrazol-4-yl]-benzoxazin-3-one derivatives as novel selective nonsteroidal mineralocorticoid receptor antagonists. Bioorg Med Chem22:5428-45 (2014) 
 
Mineralocorticoid receptor
Name:Mineralocorticoid receptor
Type:Enzyme
Mol. Mass.:107076.42
Organism:Homo sapiens (Human)
Description:P08235
Residue:984
BDBM50024849
NameBDBM50024849
Synonyms:CHEMBL3337825
TypeSmall organic molecule
Emp. Form.C22H19F4N3O2
Mol. Mass.433.3988
SMILESCc1nn(CCCC(F)(F)F)c(c1-c1ccc2OCC(=O)Nc2c1)-c1ccc(F)cc1