Reaction Details
TargetAcetylcholinesterase
LigandBDBM50024881
Substrate/Competitorn/a
Meas. Tech.ChEMBL_1439641 (CHEMBL3383711)
IC50 900±n/a nM
Citation Gulcan, HOUnlu, SEsiringu, IErcetin, TSahin, YOz, DSahin, MF Design, synthesis and biological evaluation of novel 6H-benzo[c]chromen-6-one, and 7,8,9,10-tetrahydro-benzo[c]chromen-6-one derivatives as potential cholinesterase inhibitors. Bioorg Med Chem22:5141-54 (2014) 
 
Acetylcholinesterase
Name:Acetylcholinesterase
Type:Enzyme
Mol. Mass.:67792.70
Organism:Homo sapiens (Human)
Description:P22303
Residue:614
BDBM50024881
NameBDBM50024881
Synonyms:CHEMBL3335060
TypeSmall organic molecule
Emp. Form.C26H26N2O3
Mol. Mass.414.4962
SMILESO=c1oc2cc(OCCN3CCN(Cc4ccccc4)CC3)ccc2c2ccccc12