Reaction Details
TargetAcetylcholinesterase
LigandBDBM50024865
Substrate/Competitorn/a
Meas. Tech.ChEMBL_1439641 (CHEMBL3383711)
IC50 10900±n/a nM
Citation Gulcan, HOUnlu, SEsiringu, IErcetin, TSahin, YOz, DSahin, MF Design, synthesis and biological evaluation of novel 6H-benzo[c]chromen-6-one, and 7,8,9,10-tetrahydro-benzo[c]chromen-6-one derivatives as potential cholinesterase inhibitors. Bioorg Med Chem22:5141-54 (2014) 
 
Acetylcholinesterase
Name:Acetylcholinesterase
Type:Enzyme
Mol. Mass.:67792.70
Organism:Homo sapiens (Human)
Description:P22303
Residue:614
BDBM50024865
NameBDBM50024865
Synonyms:CHEMBL3335017
TypeSmall organic molecule
Emp. Form.C17H18ClNO2
Mol. Mass.303.783
SMILESCl.CC(N(C)C)c1ccc2c(c1)oc(=O)c1ccccc21