Reaction Details
TargetCasein kinase I isoform delta
LigandBDBM50025018
Substrate/Competitorn/a
Meas. Tech.ChEMBL_1440445 (CHEMBL3386826)
IC50 201±n/a nM
Citation Richter, JBischof, JZaja, MKohlhof, HOthersen, OVitt, DAlscher, VPospiech, IGarcía-Reyes, BBerg, SLeban, JKnippschild, U Difluoro-dioxolo-benzoimidazol-benzamides as potent inhibitors of CK1d ande with nanomolar inhibitory activity on cancer cell proliferation. J Med Chem57:7933-46 (2014) 
 
Casein kinase I isoform delta
Name:Casein kinase I isoform delta
Type:Enzyme
Mol. Mass.:47342.73
Organism:Rattus norvegicus (rat)
Description:Q06486
Residue:415
BDBM50025018
NameBDBM50025018
Synonyms:CHEMBL3337856
TypeSmall organic molecule
Emp. Form.C17H14F2N4O3
Mol. Mass.360.3149
SMILESCN(C)c1ccc(cc1)C(=O)Nc1nc2cc3OC(F)(F)Oc3cc2[nH]1