Reaction Details
TargetCasein kinase I isoform epsilon
LigandBDBM50025015
Substrate/Competitorn/a
Meas. Tech.ChEMBL_1440406 (CHEMBL3386219)
IC50 160±n/a nM
Citation Richter, JBischof, JZaja, MKohlhof, HOthersen, OVitt, DAlscher, VPospiech, IGarcía-Reyes, BBerg, SLeban, JKnippschild, U Difluoro-dioxolo-benzoimidazol-benzamides as potent inhibitors of CK1d ande with nanomolar inhibitory activity on cancer cell proliferation. J Med Chem57:7933-46 (2014) 
 
Casein kinase I isoform epsilon
Name:Casein kinase I isoform epsilon
Type:Protein
Mol. Mass.:47340.25
Organism:Homo sapiens (Human)
Description:P49674
Residue:416
BDBM50025015
NameBDBM50025015
Synonyms:CHEMBL3337846
TypeSmall organic molecule
Emp. Form.C16H11F2N3O4
Mol. Mass.347.273
SMILESCOc1cccc(c1)C(=O)Nc1nc2cc3OC(F)(F)Oc3cc2[nH]1