Reaction Details
TargetCasein kinase I isoform epsilon
LigandBDBM50025021
Substrate/Competitorn/a
Meas. Tech.ChEMBL_1440401 (CHEMBL3386214)
IC50 620±n/a nM
Citation Richter, JBischof, JZaja, MKohlhof, HOthersen, OVitt, DAlscher, VPospiech, IGarcía-Reyes, BBerg, SLeban, JKnippschild, U Difluoro-dioxolo-benzoimidazol-benzamides as potent inhibitors of CK1d ande with nanomolar inhibitory activity on cancer cell proliferation. J Med Chem57:7933-46 (2014) 
 
Casein kinase I isoform epsilon
Name:Casein kinase I isoform epsilon
Type:Protein
Mol. Mass.:47340.25
Organism:Homo sapiens (Human)
Description:P49674
Residue:416
BDBM50025021
NameBDBM50025021
Synonyms:CHEMBL3337853
TypeSmall organic molecule
Emp. Form.C16H9F2N7O3
Mol. Mass.385.2846
SMILESFC1(F)Oc2cc3nc(NC(=O)c4cccc(c4)-c4nnn[nH]4)[nH]c3cc2O1