Reaction Details
TargetCasein kinase I isoform delta
LigandBDBM50025023
Substrate/Competitorn/a
Meas. Tech.ChEMBL_1440399 (CHEMBL3386212)
IC50 180±n/a nM
Citation Richter, JBischof, JZaja, MKohlhof, HOthersen, OVitt, DAlscher, VPospiech, IGarcía-Reyes, BBerg, SLeban, JKnippschild, U Difluoro-dioxolo-benzoimidazol-benzamides as potent inhibitors of CK1d ande with nanomolar inhibitory activity on cancer cell proliferation. J Med Chem57:7933-46 (2014) 
 
Casein kinase I isoform delta
Name:Casein kinase I isoform delta
Type:Enzyme
Mol. Mass.:47342.73
Organism:Rattus norvegicus (rat)
Description:Q06486
Residue:415
BDBM50025023
NameBDBM50025023
Synonyms:CHEMBL3337851
TypeSmall organic molecule
Emp. Form.C16H9F4N3O4
Mol. Mass.383.254
SMILESFC(F)Oc1cccc(c1)C(=O)Nc1nc2cc3OC(F)(F)Oc3cc2[nH]1