Reaction Details
TargetAminopeptidase N
LigandBDBM50129681
Substrate/Competitorn/a
Meas. Tech.ChEMBL_1442054 (CHEMBL3373422)
Ki 7.2±n/a nM
Citation Vassiliou, SWeglarz-Tomczak, EBerlicki, LPawelczak, MNocek, BMulligan, RJoachimiak, AMucha, A Structure-guided, single-point modifications in the phosphinic dipeptide structure yield highly potent and selective inhibitors of neutral aminopeptidases. J Med Chem57:8140-51 (2014) 
 
Aminopeptidase N
Name:Aminopeptidase N
Type:PROTEIN
Mol. Mass.:109522.63
Organism:Homo sapiens (Human)
Description:ChEMBL_1507526
Residue:967
BDBM50129681
NameBDBM50129681
Synonyms:3-[(1-Amino-3-phenyl-propyl)-hydroxy-phosphinoyl]-2-(4-hydroxy-benzyl)-propionic acid | CHEMBL88808
TypeSmall organic molecule
Emp. Form.C19H24NO5P
Mol. Mass.377.3713
SMILESOC(=O)C(Cc1ccc(O)cc1)CP(O)(O)C(=N)CCc1ccccc1