Reaction Details
TargetAminopeptidase N
LigandBDBM50025048
Substrate/Competitorn/a
Meas. Tech.ChEMBL_1442055 (CHEMBL3373423)
Ki 4.1±n/a nM
Citation Vassiliou, SWeglarz-Tomczak, EBerlicki, LPawelczak, MNocek, BMulligan, RJoachimiak, AMucha, A Structure-guided, single-point modifications in the phosphinic dipeptide structure yield highly potent and selective inhibitors of neutral aminopeptidases. J Med Chem57:8140-51 (2014) 
 
Aminopeptidase N
Name:Aminopeptidase N
Type:Protein
Mol. Mass.:108810.25
Organism:Sus scrofa (Pig)
Description:P15145
Residue:963
BDBM50025048
NameBDBM50025048
Synonyms:CHEMBL3355099
TypeSmall organic molecule
Emp. Form.C9H14NO3P
Mol. Mass.215.1861
SMILESN[C@@H](CCc1ccccc1)P(O)(O)=O