Reaction Details
TargetCytosol aminopeptidase [33-68,L62W]
LigandBDBM50316049
Substrate/Competitorn/a
Meas. Tech.ChEMBL_1442056 (CHEMBL3373424)
Ki 4.6±n/a nM
Citation Vassiliou, SWeglarz-Tomczak, EBerlicki, LPawelczak, MNocek, BMulligan, RJoachimiak, AMucha, A Structure-guided, single-point modifications in the phosphinic dipeptide structure yield highly potent and selective inhibitors of neutral aminopeptidases. J Med Chem57:8140-51 (2014) 
 
Cytosol aminopeptidase [33-68,L62W]
Name:Cytosol aminopeptidase [33-68,L62W]
Type:Enzyme
Mol. Mass.:4015.44
Organism:Sus scrofa (Pig)
Description:P28839[33-68,L62W]
Residue:36
BDBM50316049
NameBDBM50316049
Synonyms:1-amino-3-phenylpropylphosphonic acid | CHEMBL1090914
TypeSmall organic molecule
Emp. Form.C9H14NO3P
Mol. Mass.215.1861
SMILESNC(CCc1ccccc1)P(O)(O)=O