Reaction Details
TargetCytosol aminopeptidase [33-68,L62W]
LigandBDBM50025042
Substrate/Competitorn/a
Meas. Tech.ChEMBL_1442056 (CHEMBL3373424)
Ki 50±n/a nM
Citation Vassiliou, SWeglarz-Tomczak, EBerlicki, LPawelczak, MNocek, BMulligan, RJoachimiak, AMucha, A Structure-guided, single-point modifications in the phosphinic dipeptide structure yield highly potent and selective inhibitors of neutral aminopeptidases. J Med Chem57:8140-51 (2014) 
 
Cytosol aminopeptidase [33-68,L62W]
Name:Cytosol aminopeptidase [33-68,L62W]
Type:Enzyme
Mol. Mass.:4015.44
Organism:Sus scrofa (Pig)
Description:P28839[33-68,L62W]
Residue:36
BDBM50025042
NameBDBM50025042
Synonyms:CHEMBL3355105
TypeSmall organic molecule
Emp. Form.C18H23N2O4P
Mol. Mass.362.36
SMILESNC(CCc1cccnc1)P(O)(=O)CC(Cc1ccccc1)C(O)=O