Reaction Details
TargetCytosol aminopeptidase [33-68,L62W]
LigandBDBM50025099
Substrate/Competitorn/a
Meas. Tech.ChEMBL_1442056 (CHEMBL3373424)
Ki 108±n/a nM
Citation Vassiliou, SWeglarz-Tomczak, EBerlicki, LPawelczak, MNocek, BMulligan, RJoachimiak, AMucha, A Structure-guided, single-point modifications in the phosphinic dipeptide structure yield highly potent and selective inhibitors of neutral aminopeptidases. J Med Chem57:8140-51 (2014) 
 
Cytosol aminopeptidase [33-68,L62W]
Name:Cytosol aminopeptidase [33-68,L62W]
Type:Enzyme
Mol. Mass.:4015.44
Organism:Sus scrofa (Pig)
Description:P28839[33-68,L62W]
Residue:36
BDBM50025099
NameBDBM50025099
Synonyms:CHEMBL3355111
TypeSmall organic molecule
Emp. Form.C19H26N3O4P
Mol. Mass.391.4012
SMILESNCc1cccc(CC(CP(O)(=O)C(N)CCc2ccncc2)C(O)=O)c1