Reaction Details
TargetKappa-type opioid receptor
LigandBDBM50025270
Substrate/Competitorn/a
Meas. Tech.ChEMBL_1431192 (CHEMBL3385055)
Ki 323±n/a nM
Citation Polepally, PRHuben, KVardy, ESetola, VMosier, PDRoth, BLZjawiony, JK Michael acceptor approach to the design of new salvinorin A-based high affinity ligands for the kappa-opioid receptor. Eur J Med Chem85:818-29 (2014) 
 
Kappa-type opioid receptor
Name:Kappa-type opioid receptor
Type:G Protein-Coupled Receptor (GPCR)
Mol. Mass.:42648.76
Organism:Homo sapiens (Human)
Description:P41145
Residue:380
BDBM50025270
NameBDBM50025270
Synonyms:CHEMBL3330676
TypeSmall organic molecule
Emp. Form.C31H32O10
Mol. Mass.564.5798
SMILES[H][C@@]12CC[C@@]3(C)[C@@H](C[C@H](OC(=O)\C=C\c4ccc5OCOc5c4)C(=O)[C@]3([H])[C@@]1(C)C[C@H](OC2=O)c1ccoc1)C(=O)OC