Reaction Details
TargetKappa-type opioid receptor
LigandBDBM50025272
Substrate/Competitorn/a
Meas. Tech.ChEMBL_1431192 (CHEMBL3385055)
Ki 281±n/a nM
Citation Polepally, PRHuben, KVardy, ESetola, VMosier, PDRoth, BLZjawiony, JK Michael acceptor approach to the design of new salvinorin A-based high affinity ligands for the kappa-opioid receptor. Eur J Med Chem85:818-29 (2014) 
 
Kappa-type opioid receptor
Name:Kappa-type opioid receptor
Type:G Protein-Coupled Receptor (GPCR)
Mol. Mass.:42648.76
Organism:Homo sapiens (Human)
Description:P41145
Residue:380
BDBM50025272
NameBDBM50025272
Synonyms:CHEMBL3330678
TypeSmall organic molecule
Emp. Form.C30H31NO10
Mol. Mass.565.5678
SMILES[H][C@@]12CC[C@@]3(C)[C@@H](C[C@H](OC(=O)\C=C\c4ccc(cc4)[N+]([O-])=O)C(=O)[C@]3([H])[C@@]1(C)C[C@H](OC2=O)c1ccoc1)C(=O)OC