Reaction Details
TargetDelta-type opioid receptor
LigandBDBM50170670
Substrate/Competitorn/a
Meas. Tech.ChEMBL_1431191 (CHEMBL3385054)
Ki 7823±n/a nM
Citation Polepally, PRHuben, KVardy, ESetola, VMosier, PDRoth, BLZjawiony, JK Michael acceptor approach to the design of new salvinorin A-based high affinity ligands for the kappa-opioid receptor. Eur J Med Chem85:818-29 (2014) 
 
Delta-type opioid receptor
Name:Delta-type opioid receptor
Type:G Protein-Coupled Receptor (GPCR)
Mol. Mass.:40382.98
Organism:Homo sapiens (Human)
Description:Competition binding assays were carried out using membrane preparations from transfected HN9.10 cells that constitutively expressed the delta opioid receptor.
Residue:372
BDBM50170670
NameBDBM50170670
Synonyms:(3S,4aR,4bS,6S,8R,8aR,10aR)-3-Furan-3-yl-4a,8a-dimethyl-6-(2-methyl-acryloyloxy)-1,5-dioxo-dodecahydro-2-oxa-phenanthrene-8-carboxylic acid methyl ester | CHEMBL370912
TypeSmall organic molecule
Emp. Form.C25H30O8
Mol. Mass.458.5009
SMILESCOC(=O)[C@@H]1C[C@H](OC(=O)C(C)=C)C(=O)[C@H]2[C@@]1(C)CC[C@H]1C(=O)O[C@@H](C[C@]21C)c1ccoc1