Reaction Details
TargetDelta-type opioid receptor
LigandBDBM50025260
Substrate/Competitorn/a
Meas. Tech.ChEMBL_1431191 (CHEMBL3385054)
Ki>10000±n/a nM
Citation Polepally, PRHuben, KVardy, ESetola, VMosier, PDRoth, BLZjawiony, JK Michael acceptor approach to the design of new salvinorin A-based high affinity ligands for the kappa-opioid receptor. Eur J Med Chem85:818-29 (2014) 
 
Delta-type opioid receptor
Name:Delta-type opioid receptor
Type:G Protein-Coupled Receptor (GPCR)
Mol. Mass.:40382.98
Organism:Homo sapiens (Human)
Description:Competition binding assays were carried out using membrane preparations from transfected HN9.10 cells that constitutively expressed the delta opioid receptor.
Residue:372
BDBM50025260
NameBDBM50025260
Synonyms:CHEMBL3330668
TypeSmall organic molecule
Emp. Form.C26H32O8
Mol. Mass.472.5275
SMILES[H][C@@]12CC[C@@]3(C)[C@@H](C[C@H](OC(=O)C(\C)=C\C)C(=O)[C@]3([H])[C@@]1(C)C[C@H](OC2=O)c1ccoc1)C(=O)OC