Reaction Details
TargetRetinol-binding protein 4
LigandBDBM50026259
Substrate/Competitorn/a
Meas. Tech.ChEMBL_1441245 (CHEMBL3380010)
IC50 0.235000±n/a nM
Citation Cioffi, CLDobri, NFreeman, EEConlon, MPChen, PStafford, DGSchwarz, DMGolden, KCZhu, LKitchen, DBBarnes, KDRacz, BQin, QMichelotti, ECywin, CLMartin, WHPearson, PGJohnson, GPetrukhin, K Design, synthesis, and evaluation of nonretinoid retinol binding protein 4 antagonists for the potential treatment of atrophic age-related macular degeneration and Stargardt disease. J Med Chem57:7731-57 (2014) 
 
Retinol-binding protein 4
Name:Retinol-binding protein 4
Type:Protein
Mol. Mass.:23008.75
Organism:Homo sapiens (Human)
Description:P02753
Residue:201
BDBM50026259
NameBDBM50026259
Synonyms:CHEMBL3359023
TypeSmall organic molecule
Emp. Form.C22H22F3N3O3
Mol. Mass.433.4236
SMILES[H][C@@]12C[C@@H](C[C@]1([H])CN(C2)C(=O)Nc1cc(C)ncc1C(O)=O)c1ccccc1C(F)(F)F