Reaction Details
TargetHistamine H3 receptor
LigandBDBM50026360
Substrate/Competitorn/a
Meas. Tech.ChEMBL_1432176 (CHEMBL3390512)
Ki 13±n/a nM
Citation Lipani, LOdadzic, DWeizel, LSchwed, JSSadek, BStark, H Studies on molecular properties prediction and histamine H3 receptor affinities of novel ligands with uracil-based motifs. Eur J Med Chem86:578-88 (2014) 
 
Histamine H3 receptor
Name:Histamine H3 receptor
Type:G Protein-Coupled Receptor (GPCR)
Mol. Mass.:48691.47
Organism:Homo sapiens (Human)
Description:Binding assays were using CHO cells stably expressing hH3R receptors.
Residue:445
BDBM50026360
NameBDBM50026360
Synonyms:CHEMBL3331151
TypeSmall organic molecule
Emp. Form.C19H25N3O3
Mol. Mass.343.4201
SMILESO=c1ccn(Cc2ccc(OCCCN3CCCCC3)cc2)c(=O)[nH]1