Reaction Details
TargetHistone deacetylase 2
LigandBDBM50026431
Substrate/Competitorn/a
Meas. Tech.ChEMBL_1433878 (CHEMBL3388839)
IC50 226±n/a nM
Citation Yao, YLiao, CLi, ZWang, ZSun, QLiu, CYang, YTu, ZJiang, S Design, synthesis, and biological evaluation of 1, 3-disubstituted-pyrazole derivatives as new class I and IIb histone deacetylase inhibitors. Eur J Med Chem86:639-52 (2014) 
 
Histone deacetylase 2
Name:Histone deacetylase 2
Type:Chromatin regulator; hydrolase; repressor
Mol. Mass.:55356.54
Organism:Homo sapiens (Human)
Description:Q92769
Residue:488
BDBM50026431
NameBDBM50026431
Synonyms:CHEMBL3335300
TypeSmall organic molecule
Emp. Form.C21H23N3O2
Mol. Mass.349.4262
SMILESONC(=O)CCCCc1ccn(Cc2ccc(cc2)-c2ccccc2)n1