Reaction Details
TargetHistone deacetylase 7
LigandBDBM50026434
Substrate/Competitorn/a
Meas. Tech.ChEMBL_1433883 (CHEMBL3388844)
IC50 628±n/a nM
Citation Yao, YLiao, CLi, ZWang, ZSun, QLiu, CYang, YTu, ZJiang, S Design, synthesis, and biological evaluation of 1, 3-disubstituted-pyrazole derivatives as new class I and IIb histone deacetylase inhibitors. Eur J Med Chem86:639-52 (2014) 
 
Histone deacetylase 7
Name:Histone deacetylase 7
Type:Chromatin regulator; hydrolase; repressor
Mol. Mass.:102942.62
Organism:Homo sapiens (Human)
Description:Q8WUI4
Residue:952
BDBM50026434
NameBDBM50026434
Synonyms:CHEMBL3335297
TypeSmall organic molecule
Emp. Form.C21H23N3O3
Mol. Mass.365.4256
SMILESONC(=O)CCCCc1ccn(Cc2ccc(Oc3ccccc3)cc2)n1