Reaction Details
TargetHistone deacetylase 9
LigandBDBM50026450
Substrate/Competitorn/a
Meas. Tech.ChEMBL_1433884 (CHEMBL3388845)
IC50 48900±n/a nM
Citation Yao, YLiao, CLi, ZWang, ZSun, QLiu, CYang, YTu, ZJiang, S Design, synthesis, and biological evaluation of 1, 3-disubstituted-pyrazole derivatives as new class I and IIb histone deacetylase inhibitors. Eur J Med Chem86:639-52 (2014) 
 
Histone deacetylase 9
Name:Histone deacetylase 9
Type:Enzyme
Mol. Mass.:111304.31
Organism:Homo sapiens (Human)
Description:Q9UKV0
Residue:1011
BDBM50026450
NameBDBM50026450
Synonyms:CHEMBL3335283
TypeSmall organic molecule
Emp. Form.C21H23N3O2
Mol. Mass.349.4262
SMILESONC(=O)CCCCc1ccn(Cc2cccc(c2)-c2ccccc2)n1