Reaction Details
TargetHistone deacetylase 6
LigandBDBM50026429
Substrate/Competitorn/a
Meas. Tech.ChEMBL_1433885 (CHEMBL3388846)
IC50 65±n/a nM
Citation Yao, YLiao, CLi, ZWang, ZSun, QLiu, CYang, YTu, ZJiang, S Design, synthesis, and biological evaluation of 1, 3-disubstituted-pyrazole derivatives as new class I and IIb histone deacetylase inhibitors. Eur J Med Chem86:639-52 (2014) 
 
Histone deacetylase 6
Name:Histone deacetylase 6
Type:Chromatin regulator; hydrolase; repressor
Mol. Mass.:131381.51
Organism:Homo sapiens (Human)
Description:Q9UBN7
Residue:1215
BDBM50026429
NameBDBM50026429
Synonyms:CHEMBL3335299
TypeSmall organic molecule
Emp. Form.C21H24N4O2
Mol. Mass.364.4409
SMILESONC(=O)CCCCc1ccn(Cc2ccc(Nc3ccccc3)cc2)n1