Reaction Details
Target17-beta-hydroxysteroid dehydrogenase type 1
LigandBDBM50026598
Substrate/Competitorn/a
Meas. Tech.ChEMBL_1435361 (CHEMBL3382869)
IC50 195±n/a nM
Citation Schmitt, CMiralinaghi, PMariano, MHartmann, RWEngel, M Hydroxybenzothiophene Ketones Are Efficient Pre-mRNA Splicing Modulators Due to Dual Inhibition of Dyrk1A and Clk1/4. ACS Med Chem Lett5:963-7 (2014) 
 
17-beta-hydroxysteroid dehydrogenase type 1
Name:17-beta-hydroxysteroid dehydrogenase type 1
Type:Enzyme
Mol. Mass.:34945.13
Organism:Homo sapiens (Human)
Description:P14061
Residue:328
BDBM50026598
NameBDBM50026598
Synonyms:CHEMBL3335356
TypeSmall organic molecule
Emp. Form.C16H12O3S
Mol. Mass.284.33
SMILESCc1ccc(cc1O)C(=O)c1cc2cc(O)ccc2s1