Reaction Details
TargetDual specificity protein kinase CLK1
LigandBDBM50026622
Substrate/Competitorn/a
Meas. Tech.ChEMBL_1435352 (CHEMBL3382860)
IC50 170±n/a nM
Citation Schmitt, CMiralinaghi, PMariano, MHartmann, RWEngel, M Hydroxybenzothiophene Ketones Are Efficient Pre-mRNA Splicing Modulators Due to Dual Inhibition of Dyrk1A and Clk1/4. ACS Med Chem Lett5:963-7 (2014) 
 
Dual specificity protein kinase CLK1
Name:Dual specificity protein kinase CLK1
Type:Protein
Mol. Mass.:57322.21
Organism:Homo sapiens (Human)
Description:P49759
Residue:484
BDBM50026622
NameBDBM50026622
Synonyms:CHEMBL408982
TypeSmall organic molecule
Emp. Form.C13H15NO2S
Mol. Mass.249.329
SMILESCCN1\C(Sc2ccc(OC)cc12)=C\C(C)=O