Reaction Details
TargetHistone deacetylase 4
LigandBDBM50026644
Substrate/Competitorn/a
Meas. Tech.ChEMBL_1436050 (CHEMBL3384102)
IC50 7600±n/a nM
Citation Giacomini, ENebbioso, ACiotta, AIanni, CFalchi, FRoberti, MTolomeo, MGrimaudo, SCristina, ADPipitone, RMAltucci, LRecanatini, M Novel antiproliferative chimeric compounds with marked histone deacetylase inhibitory activity. ACS Med Chem Lett5:973-8 (2014) 
 
Histone deacetylase 4
Name:Histone deacetylase 4
Type:Enzyme
Mol. Mass.:119049.39
Organism:Homo sapiens (Human)
Description:P56524
Residue:1084
BDBM50026644
NameBDBM50026644
Synonyms:CHEMBL3335370
TypeSmall organic molecule
Emp. Form.C25H32N2O6
Mol. Mass.456.5314
SMILESCOc1cc(OC)cc(\C=C/c2ccc(OC)c(NC(=O)CCCCCCC(=O)NO)c2)c1