Reaction Details
TargetHistone deacetylase 6
LigandBDBM50026644
Substrate/Competitorn/a
Meas. Tech.ChEMBL_1436051 (CHEMBL3384103)
IC50 1600±n/a nM
Citation Giacomini, ENebbioso, ACiotta, AIanni, CFalchi, FRoberti, MTolomeo, MGrimaudo, SCristina, ADPipitone, RMAltucci, LRecanatini, M Novel antiproliferative chimeric compounds with marked histone deacetylase inhibitory activity. ACS Med Chem Lett5:973-8 (2014) 
 
Histone deacetylase 6
Name:Histone deacetylase 6
Type:Chromatin regulator; hydrolase; repressor
Mol. Mass.:131381.51
Organism:Homo sapiens (Human)
Description:Q9UBN7
Residue:1215
BDBM50026644
NameBDBM50026644
Synonyms:CHEMBL3335370
TypeSmall organic molecule
Emp. Form.C25H32N2O6
Mol. Mass.456.5314
SMILESCOc1cc(OC)cc(\C=C/c2ccc(OC)c(NC(=O)CCCCCCC(=O)NO)c2)c1