Reaction Details
TargetVascular endothelial growth factor receptor 1/2/3
LigandBDBM50026673
Substrate/Competitorn/a
Meas. Tech.ChEMBL_1436091 (CHEMBL3384722)
IC50<10.0±n/a nM
Citation Subramanian, SCostales, AWilliams, TELevine, BMcBride, CMPoon, DAmiri, PRenhowe, PAShafer, CMStuart, DVerhagen, JRamurthy, S Design and Synthesis of Orally Bioavailable Benzimidazole Reverse Amides as Pan RAF Kinase Inhibitors. ACS Med Chem Lett5:989-92 (2014) 
 
Vascular endothelial growth factor receptor 1/2/3
Name:Vascular endothelial growth factor receptor 1/2/3
Synonyms:Vascular endothelial growth factor receptor
Type:n/a
Mol. Mass.:n/a
Description:ASSAY_ID of ChEMBL is 213950
Components:This complex has 3 components.
Component 1
Name:Vascular endothelial growth factor receptor 2
Type:Receptor Tyrosine Kinase
Mol. Mass.:151510.97
Organism:Homo sapiens (Human)
Description:P35968
Residue:1356
Component 2
Name:Vascular endothelial growth factor receptor 1
Synonyms:FLT FRT Fms-like tyrosine kinase 1 Tyrosine-protein kinase FRT VEGFR-1 VGFR1_HUMAN Vascular endothelial growth factor receptor 1 (FLT1) Vascular endothelial growth factor receptor 1 and 2 (Flt-1 and KDR) Vascular permeability factor receptor vascular endothelial growth factor/vascular permeability factor receptor
Type:Receptor Tyrosine Kinase
Mol. Mass.:150800.23
Organism:Homo sapiens (Human)
Description:P17948
Residue:1338
Component 3
Name:Vascular endothelial growth factor receptor 3
Synonyms:FLT-4 Fms-like tyrosine kinase 4 VEGFR-3 VGFR3_HUMAN Vascular endothelial growth factor receptor 3 (VEGFR-3) | Vascular endothelial growth factor receptor 3 (VEGFR3)
Type:Protein
Mol. Mass.:152749.58
Organism:Homo sapiens (Human)
Description:P35916-2
Residue:1363
BDBM50026673
NameBDBM50026673
Synonyms:CHEMBL3335387
TypeSmall organic molecule
Emp. Form.C28H29F4N7O2
Mol. Mass.571.5692
SMILESCCN1CCN(CC(=O)Nc2cc(Oc3ccc4n(C)c(Nc5cc(ccc5F)C(F)(F)F)nc4c3)ccn2)CC1