Reaction Details
TargetSerine/threonine-protein kinase B-raf
LigandBDBM50026679
Substrate/Competitorn/a
Meas. Tech.ChEMBL_1436082 (CHEMBL3384713)
IC50 3.0±n/a nM
Citation Subramanian, SCostales, AWilliams, TELevine, BMcBride, CMPoon, DAmiri, PRenhowe, PAShafer, CMStuart, DVerhagen, JRamurthy, S Design and Synthesis of Orally Bioavailable Benzimidazole Reverse Amides as Pan RAF Kinase Inhibitors. ACS Med Chem Lett5:989-92 (2014) 
 
Serine/threonine-protein kinase B-raf
Name:Serine/threonine-protein kinase B-raf
Type:Serine/threonine-protein kinase
Mol. Mass.:84446.00
Organism:Homo sapiens (Human)
Description:P15056
Residue:766
BDBM50026679
NameBDBM50026679
Synonyms:CHEMBL3335371
TypeSmall organic molecule
Emp. Form.C25H27N5O2
Mol. Mass.429.5142
SMILESCC(=O)Nc1cc(Oc2ccc3n(C)c(Nc4cccc(c4)C(C)(C)C)nc3c2)ccn1