Reaction Details
TargetThromboxane A2 receptor
LigandBDBM50026757
Substrate/Competitorn/a
Meas. Tech.ChEMBL_1437451 (CHEMBL3387261)
IC50 892±n/a nM
Citation Wang, XLiu, LHuang, LHerbst-Robinson, KCornec, ASJames, MJSugiyama, SBassetto, MBrancale, ATrojanowski, JQLee, VMSmith, ABBrunden, KRBallatore, C Potent, long-acting cyclopentane-1,3-Dione thromboxane (A2)-receptor antagonists. ACS Med Chem Lett5:1015-20 (2014) 
 
Thromboxane A2 receptor
Name:Thromboxane A2 receptor
Type:Enyzme
Mol. Mass.:37445.28
Organism:Homo sapiens (Human)
Description:P21731
Residue:343
BDBM50026757
NameBDBM50026757
Synonyms:CHEMBL3335483
TypeSmall organic molecule
Emp. Form.C26H30ClNO4S
Mol. Mass.488.039
SMILESOC1=C(C2CCCCC2)C(=O)C(Cc2cccc(CCNS(=O)(=O)c3ccc(Cl)cc3)c2)C1