Reaction Details
TargetDelta-type opioid receptor
LigandBDBM50026764
Substrate/Competitorn/a
Meas. Tech.ChEMBL_1437483 (CHEMBL3387854)
Ki 1.8±n/a nM
Citation Mollica, ACarotenuto, ANovellino, ELimatola, ACostante, RPinnen, FStefanucci, APieretti, SBorsodi, ASamavati, RZador, FBenyhe, SDavis, PPorreca, FHruby, VJ Novel cyclic biphalin analogue with improved antinociceptive properties. ACS Med Chem Lett5:1032-6 (2014) 
 
Delta-type opioid receptor
Name:Delta-type opioid receptor
Type:G Protein-Coupled Receptor (GPCR)
Mol. Mass.:40465.04
Organism:Rattus norvegicus (rat)
Description:Competition binding assays were using CHO-K1 cell membranes expressing the opioid receptor.
Residue:372
BDBM50026764
NameBDBM50026764
Synonyms:CHEMBL3331509
TypeSmall organic molecule
Emp. Form.C40H57N7O11
Mol. Mass.811.9209
SMILESCC[C@H](C)[C@H](NC(=O)[C@@H](NC(=O)[C@H](CCC(O)=O)NC(=O)[C@H](Cc1ccccc1)NC(=O)[C@H](C)NC(=O)[C@@H](N)Cc1ccc(O)cc1)[C@@H](C)CC)C(=O)NCC(O)=O