Reaction Details
TargetAdenosine receptor A1
LigandBDBM35804
Substrate/Competitorn/a
Meas. Tech.ChEMBL_1438218 (CHEMBL3390250)
Ki 380±n/a nM
Citation Moss, SMJayasekara, PSPaoletta, SGao, ZGJacobson, KA Structure-Based Design of Reactive Nucleosides for Site-Specific Modification of the A2A Adenosine Receptor. ACS Med Chem Lett5:1043-8 (2014) 
 
Adenosine receptor A1
Name:Adenosine receptor A1
Type:G Protein-Coupled Receptor (GPCR)
Mol. Mass.:36520.92
Organism:Homo sapiens (Human)
Description:P30542
Residue:326
BDBM35804
NameBDBM35804
Synonyms:(CGS21680) 3-(4-{2-[6-Amino-9-(5-ethylcarbamoylmethyl-3,4-dihydroxy-tetrahydro-furan-2-yl)-9H-purin-2-ylamino]-ethyl}-phenyl)-propionic acid 2-[4-(2-carboxyethyl)phenethylamino]-5''''-N-ethylcarboxamidoadenosine 3-(4-(2-(6-amino-9-((2R,3R,4S,5S)-5-(ethylcarbamoyl)-3,4-dihydroxy-tetrahydrofuran-2-yl)-9H-purin-2-ylamino)ethyl)phenyl)propanoic acid 3-(4-{2-[6-Amino-9-((2R,3R,4S,5S)-5-ethylcarbamoyl-3,4-dihydroxy-tetrahydro-furan-2-yl)-9H-purin-2-ylamino]-ethyl}-phenyl)-propionic acid CGS-21680 [3H]-CGS 21680
Typeradiolabeled ligand
Emp. Form.C23H29N7O6
Mol. Mass.499.5197
SMILESCCNC(=O)[C@H]1O[C@H]([C@H](O)[C@@H]1O)n1cnc2c(N)nc(NCCc3ccc(CCC(O)=O)cc3)nc12