Reaction Details
TargetAdenosine receptor A1
LigandBDBM50026816
Substrate/Competitorn/a
Meas. Tech.ChEMBL_1438218 (CHEMBL3390250)
Ki 500±n/a nM
Citation Moss, SMJayasekara, PSPaoletta, SGao, ZGJacobson, KA Structure-Based Design of Reactive Nucleosides for Site-Specific Modification of the A2A Adenosine Receptor. ACS Med Chem Lett5:1043-8 (2014) 
 
Adenosine receptor A1
Name:Adenosine receptor A1
Type:G Protein-Coupled Receptor (GPCR)
Mol. Mass.:36520.92
Organism:Homo sapiens (Human)
Description:P30542
Residue:326
BDBM50026816
NameBDBM50026816
Synonyms:CHEMBL3335523
TypeSmall organic molecule
Emp. Form.C31H35N9O9
Mol. Mass.677.6645
SMILESCCNC(=O)[C@H]1O[C@H]([C@H](O)[C@@H]1O)n1cnc2c(N)nc(NCCc3ccc(CCC(=O)Nc4ccc(OC(C)=O)c(c4)[N+]([O-])=O)cc3)nc12