Reaction Details
TargetAdenosine receptor A2a
LigandBDBM50026819
Substrate/Competitorn/a
Meas. Tech.ChEMBL_1438219 (CHEMBL3390251)
Ki 3280±n/a nM
Citation Moss, SMJayasekara, PSPaoletta, SGao, ZGJacobson, KA Structure-Based Design of Reactive Nucleosides for Site-Specific Modification of the A2A Adenosine Receptor. ACS Med Chem Lett5:1043-8 (2014) 
 
Adenosine receptor A2a
Name:Adenosine receptor A2a
Type:G Protein-Coupled Receptor (GPCR)
Mol. Mass.:44716.46
Organism:Homo sapiens (Human)
Description:P29274
Residue:412
BDBM50026819
NameBDBM50026819
Synonyms:CHEMBL3335525
TypeSmall organic molecule
Emp. Form.C39H47N11O10S
Mol. Mass.861.923
SMILES[H][C@]12CS[C@@H](CCCCC(=O)Oc3ccc(NC(=O)CCc4ccc(CCNc5nc(N)c6ncn([C@@H]7O[C@@H]([C@@H](O)[C@H]7O)C(=O)NCC)c6n5)cc4)cc3[N+]([O-])=O)[C@@]1([H])NC(=O)N2