Reaction Details
TargetAdenosine receptor A3
LigandBDBM50026816
Substrate/Competitorn/a
Meas. Tech.ChEMBL_1438220 (CHEMBL3390252)
Ki 207±n/a nM
Citation Moss, SMJayasekara, PSPaoletta, SGao, ZGJacobson, KA Structure-Based Design of Reactive Nucleosides for Site-Specific Modification of the A2A Adenosine Receptor. ACS Med Chem Lett5:1043-8 (2014) 
 
Adenosine receptor A3
Name:Adenosine receptor A3
Type:G Protein-Coupled Receptor (GPCR)
Mol. Mass.:36197.32
Organism:Homo sapiens (Human)
Description:P0DMS8
Residue:318
BDBM50026816
NameBDBM50026816
Synonyms:CHEMBL3335523
TypeSmall organic molecule
Emp. Form.C31H35N9O9
Mol. Mass.677.6645
SMILESCCNC(=O)[C@H]1O[C@H]([C@H](O)[C@@H]1O)n1cnc2c(N)nc(NCCc3ccc(CCC(=O)Nc4ccc(OC(C)=O)c(c4)[N+]([O-])=O)cc3)nc12