Reaction Details
TargetAdenosine receptor A3
LigandBDBM50026817
Substrate/Competitorn/a
Meas. Tech.ChEMBL_1438220 (CHEMBL3390252)
Ki 171±n/a nM
Citation Moss, SMJayasekara, PSPaoletta, SGao, ZGJacobson, KA Structure-Based Design of Reactive Nucleosides for Site-Specific Modification of the A2A Adenosine Receptor. ACS Med Chem Lett5:1043-8 (2014) 
 
Adenosine receptor A3
Name:Adenosine receptor A3
Type:G Protein-Coupled Receptor (GPCR)
Mol. Mass.:36197.32
Organism:Homo sapiens (Human)
Description:P0DMS8
Residue:318
BDBM50026817
NameBDBM50026817
Synonyms:CHEMBL3335526
TypeSmall organic molecule
Emp. Form.C29H33N9O8
Mol. Mass.635.6278
SMILESCCNC(=O)[C@H]1O[C@H]([C@H](O)[C@@H]1O)n1cnc2c(N)nc(NCCc3ccc(CCC(=O)Nc4ccc(O)c(c4)[N+]([O-])=O)cc3)nc12