Reaction Details
TargetP-selectin
LigandBDBM50026886
Substrate/Competitorn/a
Meas. Tech.ChEMBL_1438999 (CHEMBL3383106)
IC50 21000±n/a nM
Citation Calosso, MTambutet, GCharpentier, DSt-Pierre, GVaillancourt, MBencheqroun, MGratton, JPPrévost, MGuindon, Y Acyclic tethers mimicking subunits of polysaccharide ligands: selectin antagonists. ACS Med Chem Lett5:1054-9 (2014) 
 
P-selectin
Name:P-selectin
Type:PROTEIN
Mol. Mass.:90834.61
Organism:Homo sapiens (Human)
Description:ChEMBL_1438999
Residue:830
BDBM50026886
NameBDBM50026886
Synonyms:CHEMBL3335532
TypeSmall organic molecule
Emp. Form.C43H50O19
Mol. Mass.870.8457
SMILESCOC(=O)[C@H](O[C@@H]1O[C@@H](C)[C@@H](O)[C@@H](O)[C@@H]1O)[C@@H](O[C@@H]1O[C@H](CO)[C@H](OC(=O)c2ccccc2)[C@H](O[C@H](Cc2ccccc2)C(O)=O)[C@H]1OC(=O)c1ccccc1)C(=O)OC(C)C