Reaction Details
TargetD(3) dopamine receptor
LigandBDBM50027078
Substrate/Competitorn/a
Meas. Tech.ChEMBL_1439004 (CHEMBL3383111)
Ki 2770±n/a nM
Citation Berry, CBBubser, MJones, CKHayes, JPWepy, JALocuson, CWDaniels, JSLindsley, CWHopkins, CR Discovery and Characterization of ML398, a Potent and Selective Antagonist of the D4 Receptor with in Vivo Activity. ACS Med Chem Lett5:1060-4 (2014) 
 
D(3) dopamine receptor
Name:D(3) dopamine receptor
Type:n/a
Mol. Mass.:44243.43
Organism:Homo sapiens (Human)
Description:n/a
Residue:400
BDBM50027078
NameBDBM50027078
Synonyms:CHEMBL3335538
TypeSmall organic molecule
Emp. Form.C20H22F3NO2
Mol. Mass.365.3894
SMILESFC(F)(F)Oc1ccc(CN2CCOC(CCc3ccccc3)C2)cc1