Reaction Details
TargetD(2) dopamine receptor
LigandBDBM50027079
Substrate/Competitorn/a
Meas. Tech.ChEMBL_1439009 (CHEMBL3383656)
IC50 16500±n/a nM
Citation Berry, CBBubser, MJones, CKHayes, JPWepy, JALocuson, CWDaniels, JSLindsley, CWHopkins, CR Discovery and Characterization of ML398, a Potent and Selective Antagonist of the D4 Receptor with in Vivo Activity. ACS Med Chem Lett5:1060-4 (2014) 
 
D(2) dopamine receptor
Name:D(2) dopamine receptor
Type:Cell-surface receptors
Mol. Mass.:50647.10
Organism:Homo sapiens (Human)
Description:P14416
Residue:443
BDBM50027079
NameBDBM50027079
Synonyms:CHEMBL3335539
TypeSmall organic molecule
Emp. Form.C20H25NO2
Mol. Mass.311.418
SMILESCOc1ccc(CN2CCOC(CCc3ccccc3)C2)cc1