Reaction Details
TargetD(2) dopamine receptor
LigandBDBM50027080
Substrate/Competitorn/a
Meas. Tech.ChEMBL_1439009 (CHEMBL3383656)
Ki 5500±n/a nM
Citation Berry, CBBubser, MJones, CKHayes, JPWepy, JALocuson, CWDaniels, JSLindsley, CWHopkins, CR Discovery and Characterization of ML398, a Potent and Selective Antagonist of the D4 Receptor with in Vivo Activity. ACS Med Chem Lett5:1060-4 (2014) 
 
D(2) dopamine receptor
Name:D(2) dopamine receptor
Type:Cell-surface receptors
Mol. Mass.:50647.10
Organism:Homo sapiens (Human)
Description:P14416
Residue:443
BDBM50027080
NameBDBM50027080
Synonyms:CHEMBL3335554
TypeSmall organic molecule
Emp. Form.C20H22F3NO2
Mol. Mass.365.3894
SMILESFC(F)(F)Oc1ccc(CN2CCO[C@H](CCc3ccccc3)C2)cc1